Reaction Details
TargetCoagulation factor X
LigandBDBM50142129
Substrate/Competitorn/a
Meas. Tech.ChEBML_49138
IC50 1±n/a nM
Citation Zhang, PBao, LZuckett, JFGoldman, EAJia, ZJArfsten, AEdwards, SSinha, UHutchaleelaha, APark, GLambing, JLHollenbach, SJScarborough, RMZhu, BY Design, synthesis, and SAR of anthranilamide-based factor Xa inhibitors incorporating substituted biphenyl P4 motifs. Bioorg Med Chem Lett14:983-7 (2004) 
 
Coagulation factor X
Name:Coagulation factor X
Type:Enzyme
Mol. Mass.:54726.60
Organism:Homo sapiens (Human)
Description:n/a
Residue:488
BDBM50142129
NameBDBM50142129
Synonyms:2'-(4-Hydroxy-piperidin-1-yl)-biphenyl-4-carboxylic acid [4-chloro-2-(5-chloro-pyridin-2-ylcarbamoyl)-phenyl]-amide | CHEMBL174815
TypeSmall organic molecule
Emp. Form.C30H26Cl2N4O3
Mol. Mass.561.458
SMILESOC1CCN(CC1)c1ccccc1-c1ccc(cc1)C(=O)Nc1ccc(Cl)cc1C(=O)Nc1ccc(Cl)cn1