Reaction Details
TargetVitamin K-dependent protein C
LigandBDBM50142087
Substrate/Competitorn/a
Meas. Tech.ChEBML_27866
IC50>10000±n/a nM
Citation Zhang, PBao, LZuckett, JFGoldman, EAJia, ZJArfsten, AEdwards, SSinha, UHutchaleelaha, APark, GLambing, JLHollenbach, SJScarborough, RMZhu, BY Design, synthesis, and SAR of anthranilamide-based factor Xa inhibitors incorporating substituted biphenyl P4 motifs. Bioorg Med Chem Lett14:983-7 (2004) 
 
Vitamin K-dependent protein C
Name:Vitamin K-dependent protein C
Type:Enzyme
Mol. Mass.:52067.73
Organism:Homo sapiens (Human)
Description:n/a
Residue:461
BDBM50142087
NameBDBM50142087
Synonyms:2'-Sulfamoyl-biphenyl-4-carboxylic acid [2-(5-bromo-pyridin-2-ylcarbamoyl)-phenyl]-amide | CHEMBL174750
TypeSmall organic molecule
Emp. Form.C25H19BrN4O4S
Mol. Mass.551.412
SMILESNS(=O)(=O)c1ccccc1-c1ccc(cc1)C(=O)Nc1ccccc1C(=O)Nc1ccc(Br)cn1