Reaction Details
TargetCoagulation factor X
LigandBDBM50142098
Substrate/Competitorn/a
Meas. Tech.ChEBML_49138
IC50 48±n/a nM
Citation Zhang, PBao, LZuckett, JFGoldman, EAJia, ZJArfsten, AEdwards, SSinha, UHutchaleelaha, APark, GLambing, JLHollenbach, SJScarborough, RMZhu, BY Design, synthesis, and SAR of anthranilamide-based factor Xa inhibitors incorporating substituted biphenyl P4 motifs. Bioorg Med Chem Lett14:983-7 (2004) 
 
Coagulation factor X
Name:Coagulation factor X
Type:Enzyme
Mol. Mass.:54726.60
Organism:Homo sapiens (Human)
Description:n/a
Residue:488
BDBM50142098
NameBDBM50142098
Synonyms:CHEMBL175381 | N-(5-Chloro-pyridin-2-yl)-2-[(2'-sulfamoyl-biphenyl-4-carbonyl)-amino]-nicotinamide
TypeSmall organic molecule
Emp. Form.C24H18ClN5O4S
Mol. Mass.507.949
SMILESNS(=O)(=O)c1ccccc1-c1ccc(cc1)C(=O)Nc1ncccc1C(=O)Nc1ccc(Cl)cn1