Reaction Details
TargetCoagulation factor X
LigandBDBM50142105
Substrate/Competitorn/a
Meas. Tech.ChEBML_49138
IC50 16±n/a nM
Citation Zhang, PBao, LZuckett, JFGoldman, EAJia, ZJArfsten, AEdwards, SSinha, UHutchaleelaha, APark, GLambing, JLHollenbach, SJScarborough, RMZhu, BY Design, synthesis, and SAR of anthranilamide-based factor Xa inhibitors incorporating substituted biphenyl P4 motifs. Bioorg Med Chem Lett14:983-7 (2004) 
 
Coagulation factor X
Name:Coagulation factor X
Type:Enzyme
Mol. Mass.:54726.60
Organism:Homo sapiens (Human)
Description:n/a
Residue:488
BDBM50142105
NameBDBM50142105
Synonyms:3'-Piperidin-1-yl-biphenyl-4-carboxylic acid [4-chloro-2-(5-chloro-pyridin-2-ylcarbamoyl)-phenyl]-amide | CHEMBL176694
TypeSmall organic molecule
Emp. Form.C30H26Cl2N4O2
Mol. Mass.545.459
SMILESClc1ccc(NC(=O)c2cc(Cl)ccc2NC(=O)c2ccc(cc2)-c2cccc(c2)N2CCCCC2)nc1