Reaction Details
TargetCoagulation factor X
LigandBDBM50142110
Substrate/Competitorn/a
Meas. Tech.ChEBML_49138
IC50 4.6±n/a nM
Citation Zhang, PBao, LZuckett, JFGoldman, EAJia, ZJArfsten, AEdwards, SSinha, UHutchaleelaha, APark, GLambing, JLHollenbach, SJScarborough, RMZhu, BY Design, synthesis, and SAR of anthranilamide-based factor Xa inhibitors incorporating substituted biphenyl P4 motifs. Bioorg Med Chem Lett14:983-7 (2004) 
 
Coagulation factor X
Name:Coagulation factor X
Type:Enzyme
Mol. Mass.:54726.60
Organism:Homo sapiens (Human)
Description:n/a
Residue:488
BDBM50142110
NameBDBM50142110
Synonyms:2'-Sulfamoyl-biphenyl-4-carboxylic acid [4-amino-2-(5-bromo-pyridin-2-ylcarbamoyl)-phenyl]-amide | CHEMBL368676
TypeSmall organic molecule
Emp. Form.C25H20BrN5O4S
Mol. Mass.566.426
SMILESNc1ccc(NC(=O)c2ccc(cc2)-c2ccccc2S(N)(=O)=O)c(c1)C(=O)Nc1ccc(Br)cn1