Reaction Details
TargetCoagulation factor X
LigandBDBM50142117
Substrate/Competitorn/a
Meas. Tech.ChEBML_49138
IC50 1548±n/a nM
Citation Zhang, PBao, LZuckett, JFGoldman, EAJia, ZJArfsten, AEdwards, SSinha, UHutchaleelaha, APark, GLambing, JLHollenbach, SJScarborough, RMZhu, BY Design, synthesis, and SAR of anthranilamide-based factor Xa inhibitors incorporating substituted biphenyl P4 motifs. Bioorg Med Chem Lett14:983-7 (2004) 
 
Coagulation factor X
Name:Coagulation factor X
Type:Enzyme
Mol. Mass.:54726.60
Organism:Homo sapiens (Human)
Description:n/a
Residue:488
BDBM50142117
NameBDBM50142117
Synonyms:2'-Sulfamoyl-biphenyl-4-carboxylic acid [2-(5-bromo-pyridin-2-ylcarbamoyl)-4-(4-methyl-piperazin-1-yl)-phenyl]-amide | CHEMBL435525
TypeSmall organic molecule
Emp. Form.C30H29BrN6O4S
Mol. Mass.649.558
SMILESCN1CCN(CC1)c1ccc(NC(=O)c2ccc(cc2)-c2ccccc2S(N)(=O)=O)c(c1)C(=O)Nc1ccc(Br)cn1