Reaction Details
TargetCoagulation factor X
LigandBDBM50142091
Substrate/Competitorn/a
Meas. Tech.ChEMBL_49139 (CHEMBL661985)
Ki 1.8±n/a nM
Citation Zhang, PBao, LZuckett, JFGoldman, EAJia, ZJArfsten, AEdwards, SSinha, UHutchaleelaha, APark, GLambing, JLHollenbach, SJScarborough, RMZhu, BY Design, synthesis, and SAR of anthranilamide-based factor Xa inhibitors incorporating substituted biphenyl P4 motifs. Bioorg Med Chem Lett14:983-7 (2004) 
 
Coagulation factor X
Name:Coagulation factor X
Type:Enzyme
Mol. Mass.:54726.60
Organism:Homo sapiens (Human)
Description:n/a
Residue:488
BDBM50142091
NameBDBM50142091
Synonyms:3'-(Acetimidoylamino-methyl)-biphenyl-4-carboxylic acid [4-chloro-2-(5-chloro-pyridin-2-ylcarbamoyl)-phenyl]-amide | CHEMBL425142
TypeSmall organic molecule
Emp. Form.C28H23Cl2N5O2
Mol. Mass.532.421
SMILESCC(=N)NCc1cccc(c1)-c1ccc(cc1)C(=O)Nc1ccc(Cl)cc1C(=O)Nc1ccc(Cl)cn1