Reaction Details
TargetCoagulation factor X
LigandBDBM50142112
Substrate/Competitorn/a
Meas. Tech.ChEMBL_49138 (CHEMBL661984)
IC50 0.900000±n/a nM
Citation Zhang, PBao, LZuckett, JFGoldman, EAJia, ZJArfsten, AEdwards, SSinha, UHutchaleelaha, APark, GLambing, JLHollenbach, SJScarborough, RMZhu, BY Design, synthesis, and SAR of anthranilamide-based factor Xa inhibitors incorporating substituted biphenyl P4 motifs. Bioorg Med Chem Lett14:983-7 (2004) 
 
Coagulation factor X
Name:Coagulation factor X
Type:Enzyme
Mol. Mass.:54726.60
Organism:Homo sapiens (Human)
Description:n/a
Residue:488
BDBM50142112
NameBDBM50142112
Synonyms:2'-Dimethylamino-biphenyl-4-carboxylic acid [4-chloro-2-(5-chloro-pyridin-2-ylcarbamoyl)-phenyl]-amide | CHEMBL366962
TypeSmall organic molecule
Emp. Form.C27H22Cl2N4O2
Mol. Mass.505.395
SMILESCN(C)c1ccccc1-c1ccc(cc1)C(=O)Nc1ccc(Cl)cc1C(=O)Nc1ccc(Cl)cn1