Reaction Details
TargetCoagulation factor X
LigandBDBM50142177
Substrate/Competitorn/a
Meas. Tech.ChEMBL_48627 (CHEMBL659608)
IC50 0.900000±n/a nM
Citation Zhang, PBao, LZuckett, JFJia, ZJWoolfrey, JArfsten, AEdwards, SSinha, UHutchaleelaha, ALambing, JLHollenbach, SJScarborough, RMZhu, BY Design, synthesis, and SAR of anthranilamide-based factor Xa inhibitors with improved functional activity. Bioorg Med Chem Lett14:989-93 (2004) 
 
Coagulation factor X
Name:Coagulation factor X
Type:Enzyme
Mol. Mass.:54726.60
Organism:Homo sapiens (Human)
Description:n/a
Residue:488
BDBM50142177
NameBDBM50142177
Synonyms:2-{4-[(Acetimidoyl-methyl-amino)-methyl]-benzoylamino}-5-chloro-N-(5-chloro-pyridin-2-yl)-benzamide | CHEMBL176243
TypeSmall organic molecule
Emp. Form.C23H21Cl2N5O2
Mol. Mass.470.351
SMILESCN(Cc1ccc(cc1)C(=O)Nc1ccc(Cl)cc1C(=O)Nc1ccc(Cl)cn1)C(C)=N