Reaction Details
TargetCoagulation factor X
LigandBDBM50142167
Substrate/Competitorn/a
Meas. Tech.ChEBML_48817
IC50 5.8±n/a nM
Citation Zhang, PBao, LZuckett, JFJia, ZJWoolfrey, JArfsten, AEdwards, SSinha, UHutchaleelaha, ALambing, JLHollenbach, SJScarborough, RMZhu, BY Design, synthesis, and SAR of anthranilamide-based factor Xa inhibitors with improved functional activity. Bioorg Med Chem Lett14:989-93 (2004) 
 
Coagulation factor X
Name:Coagulation factor X
Type:Enzyme
Mol. Mass.:54726.60
Organism:Homo sapiens (Human)
Description:n/a
Residue:488
BDBM50142167
NameBDBM50142167
Synonyms:1-{4-[4-Chloro-2-(5-chloro-pyridin-2-ylcarbamoyl)-phenylcarbamoyl]-benzyl}-pyridinium | CHEMBL173832
TypeSmall organic molecule
Emp. Form.C25H19Cl2N4O2
Mol. Mass.478.349
SMILESClc1ccc(NC(=O)c2cc(Cl)ccc2NC(=O)c2ccc(C[n+]3ccccc3)cc2)nc1