Reaction Details
TargetCoagulation factor X
LigandBDBM50142147
Substrate/Competitorn/a
Meas. Tech.ChEBML_48817
IC50 3.5±n/a nM
Citation Zhang, PBao, LZuckett, JFJia, ZJWoolfrey, JArfsten, AEdwards, SSinha, UHutchaleelaha, ALambing, JLHollenbach, SJScarborough, RMZhu, BY Design, synthesis, and SAR of anthranilamide-based factor Xa inhibitors with improved functional activity. Bioorg Med Chem Lett14:989-93 (2004) 
 
Coagulation factor X
Name:Coagulation factor X
Type:Enzyme
Mol. Mass.:54726.60
Organism:Homo sapiens (Human)
Description:n/a
Residue:488
BDBM50142147
NameBDBM50142147
Synonyms:5-Chloro-N-(5-chloro-pyridin-2-yl)-2-[4-(2-methylimino-imidazolidin-1-ylmethyl)-benzoylamino]-benzamide | CHEMBL368494
TypeSmall organic molecule
Emp. Form.C24H22Cl2N6O2
Mol. Mass.497.376
SMILESCNC1=NCCN1Cc1ccc(cc1)C(=O)Nc1ccc(Cl)cc1C(=O)Nc1ccc(Cl)cn1