Reaction Details
TargetCoagulation factor X
LigandBDBM50142174
Substrate/Competitorn/a
Meas. Tech.ChEBML_48817
IC50 15±n/a nM
Citation Zhang, PBao, LZuckett, JFJia, ZJWoolfrey, JArfsten, AEdwards, SSinha, UHutchaleelaha, ALambing, JLHollenbach, SJScarborough, RMZhu, BY Design, synthesis, and SAR of anthranilamide-based factor Xa inhibitors with improved functional activity. Bioorg Med Chem Lett14:989-93 (2004) 
 
Coagulation factor X
Name:Coagulation factor X
Type:Enzyme
Mol. Mass.:54726.60
Organism:Homo sapiens (Human)
Description:n/a
Residue:488
BDBM50142174
NameBDBM50142174
Synonyms:5-Chloro-N-(5-chloro-pyridin-2-yl)-2-[4-(4-methyl-piperazin-1-ylmethyl)-benzoylamino]-benzamide | CHEMBL176268
TypeSmall organic molecule
Emp. Form.C25H25Cl2N5O2
Mol. Mass.498.404
SMILESCN1CCN(Cc2ccc(cc2)C(=O)Nc2ccc(Cl)cc2C(=O)Nc2ccc(Cl)cn2)CC1