Reaction Details
TargetPlasma kallikrein
LigandBDBM50142169
Substrate/Competitorn/a
Meas. Tech.ChEBML_92366
IC50 790.0±n/a nM
Citation Zhang, PBao, LZuckett, JFJia, ZJWoolfrey, JArfsten, AEdwards, SSinha, UHutchaleelaha, ALambing, JLHollenbach, SJScarborough, RMZhu, BY Design, synthesis, and SAR of anthranilamide-based factor Xa inhibitors with improved functional activity. Bioorg Med Chem Lett14:989-93 (2004) 
 
Plasma kallikrein
Name:Plasma kallikrein
Type:Protein
Mol. Mass.:71391.16
Organism:Homo sapiens (Human)
Description:P03952
Residue:638
BDBM50142169
NameBDBM50142169
Synonyms:5-Chloro-N-(5-chloro-pyridin-2-yl)-2-[4-(N,N'-dimethyl-guanidinomethyl)-benzoylamino]-benzamide | CHEMBL369681
TypeSmall organic molecule
Emp. Form.C23H22Cl2N6O2
Mol. Mass.485.366
SMILESCNC(=N)N(C)Cc1ccc(cc1)C(=O)Nc1ccc(Cl)cc1C(=O)Nc1ccc(Cl)cn1