Reaction Details
TargetPlasminogen
LigandBDBM50142163
Substrate/Competitorn/a
Meas. Tech.ChEBML_155053
IC50>11000±n/a nM
Citation Zhang, PBao, LZuckett, JFJia, ZJWoolfrey, JArfsten, AEdwards, SSinha, UHutchaleelaha, ALambing, JLHollenbach, SJScarborough, RMZhu, BY Design, synthesis, and SAR of anthranilamide-based factor Xa inhibitors with improved functional activity. Bioorg Med Chem Lett14:989-93 (2004) 
 
Plasminogen
Name:Plasminogen
Type:Enzyme
Mol. Mass.:90579.18
Organism:Homo sapiens (Human)
Description:n/a
Residue:810
BDBM50142163
NameBDBM50142163
Synonyms:5-Chloro-N-(5-chloro-pyridin-2-yl)-2-[4-(2-imino-oxazolidin-3-ylmethyl)-benzoylamino]-benzamide CHEMBL367953
TypeSmall organic molecule
Emp. Form.C23H19Cl2N5O3
Mol. Mass.484.335
SMILESClc1ccc(NC(=O)c2cc(Cl)ccc2NC(=O)c2ccc(CN3CCOC3=N)cc2)nc1