Reaction Details
TargetMelatonin receptor type 1B
LigandBDBM50142197
Substrate/Competitorn/a
Meas. Tech.ChEBML_105277
Ki 0.490000±n/a nM
Citation Epperson, JRDeskus, JAGentile, AJIben, LGRyan, ESarbin, NS 4-Substituted anilides as selective melatonin MT2 receptor agonists. Bioorg Med Chem Lett14:1023-6 (2004) 
 
Melatonin receptor type 1B
Name:Melatonin receptor type 1B
Type:Enzyme
Mol. Mass.:40203.54
Organism:Homo sapiens (Human)
Description:P49286
Residue:362
BDBM50142197
NameBDBM50142197
Synonyms:CHEMBL7807 | N-{4-[(2,3-Dihydro-benzofuran-4-yl)-methyl-amino]-phenyl}-butyramide
TypeSmall organic molecule
Emp. Form.C19H22N2O2
Mol. Mass.310.3902
SMILESCCCC(=O)Nc1ccc(cc1)N(C)c1cccc2OCCc12