Reaction Details
TargetMelatonin receptor type 1A
LigandBDBM50142228
Substrate/Competitorn/a
Meas. Tech.ChEBML_104949
Ki 18±n/a nM
Citation Epperson, JRDeskus, JAGentile, AJIben, LGRyan, ESarbin, NS 4-Substituted anilides as selective melatonin MT2 receptor agonists. Bioorg Med Chem Lett14:1023-6 (2004) 
 
Melatonin receptor type 1A
Name:Melatonin receptor type 1A
Type:Enzyme
Mol. Mass.:39392.94
Organism:Homo sapiens (Human)
Description:P48039
Residue:350
BDBM50142228
NameBDBM50142228
Synonyms:CHEMBL7700 | N-[4-(2,3-Dihydro-benzofuran-4-yloxy)-phenyl]-butyramide
TypeSmall organic molecule
Emp. Form.C18H19NO3
Mol. Mass.297.3484
SMILESCCCC(=O)Nc1ccc(Oc2cccc3OCCc23)cc1