Reaction Details
TargetMelatonin receptor type 1B
LigandBDBM50142218
Substrate/Competitorn/a
Meas. Tech.ChEBML_105277
Ki 7.2±n/a nM
Citation Epperson, JRDeskus, JAGentile, AJIben, LGRyan, ESarbin, NS 4-Substituted anilides as selective melatonin MT2 receptor agonists. Bioorg Med Chem Lett14:1023-6 (2004) 
 
Melatonin receptor type 1B
Name:Melatonin receptor type 1B
Type:Enzyme
Mol. Mass.:40203.54
Organism:Homo sapiens (Human)
Description:P49286
Residue:362
BDBM50142218
NameBDBM50142218
Synonyms:CHEMBL7556 | {4-[(3-Methoxy-phenyl)-methyl-amino]-phenyl}-carbamic acid ethyl ester
TypeSmall organic molecule
Emp. Form.C17H20N2O3
Mol. Mass.300.3523
SMILESCCOC(=O)Nc1ccc(cc1)N(C)c1cccc(OC)c1