Reaction Details
TargetMelatonin receptor type 1B
LigandBDBM50142221
Substrate/Competitorn/a
Meas. Tech.ChEBML_105277
Ki 13±n/a nM
Citation Epperson, JRDeskus, JAGentile, AJIben, LGRyan, ESarbin, NS 4-Substituted anilides as selective melatonin MT2 receptor agonists. Bioorg Med Chem Lett14:1023-6 (2004) 
 
Melatonin receptor type 1B
Name:Melatonin receptor type 1B
Type:Enzyme
Mol. Mass.:40203.54
Organism:Homo sapiens (Human)
Description:P49286
Residue:362
BDBM50142221
NameBDBM50142221
Synonyms:CHEMBL7673 | Cyclopropanecarboxylic acid [4-(3-methoxy-phenoxy)-phenyl]-amide
TypeSmall organic molecule
Emp. Form.C17H17NO3
Mol. Mass.283.3218
SMILESCOc1cccc(Oc2ccc(NC(=O)C3CC3)cc2)c1