Reaction Details
TargetMelatonin receptor type 1A
LigandBDBM50142214
Substrate/Competitorn/a
Meas. Tech.ChEBML_104949
Ki 1±n/a nM
Citation Epperson, JRDeskus, JAGentile, AJIben, LGRyan, ESarbin, NS 4-Substituted anilides as selective melatonin MT2 receptor agonists. Bioorg Med Chem Lett14:1023-6 (2004) 
 
Melatonin receptor type 1A
Name:Melatonin receptor type 1A
Type:Enzyme
Mol. Mass.:39392.94
Organism:Homo sapiens (Human)
Description:P48039
Residue:350
BDBM50142214
NameBDBM50142214
Synonyms:CHEMBL7832 | N-{4-[(3-Methoxy-phenyl)-methyl-amino]-phenyl}-propionamide
TypeSmall organic molecule
Emp. Form.C17H20N2O2
Mol. Mass.284.3529
SMILESCCC(=O)Nc1ccc(cc1)N(C)c1cccc(OC)c1