Reaction Details
TargetATP synthase subunit beta,/delta,/epsilon,/gamma, mitochondrial
LigandBDBM50404308
Substrate/Competitorn/a
Meas. Tech.ChEMBL_65930 (CHEMBL679205)
IC50 9623±n/a nM
Citation Hamann, LGDing, CZMiller, AVMadsen, CSWang, PStein, PDPudzianowski, ATGreen, DWMonshizadegan, HAtwal, KS Benzodiazepine-based selective inhibitors of mitochondrial F1F0 ATP hydrolase. Bioorg Med Chem Lett14:1031-4 (2004) 
 
ATP synthase subunit beta,/delta,/epsilon,/gamma, mitochondrial
Name:ATP synthase subunit beta,/delta,/epsilon,/gamma, mitochondrial
Synonyms:Mitochondrial complex V; ATP synthase
Type:n/a
Mol. Mass.:n/a
Description:ASSAY_ID of EBI is 65924
Components:This complex has 4 components.
Component 1
Name:ATP synthase subunit epsilon, mitochondrial
Type:PROTEIN
Mol. Mass.:5790.87
Organism:Bos taurus
Description:EBI_100264
Residue:51
Component 2
Name:ATP synthase subunit beta, mitochondrial
Synonyms:ATP5B ATPB_BOVIN
Type:PROTEIN
Mol. Mass.:56271.25
Organism:Bos taurus
Description:EBI_100264
Residue:528
Component 3
Name:ATP synthase subunit gamma, mitochondrial
Synonyms:ATP5C ATP5F1C F-ATPase gamma subunit
Type:PROTEIN
Mol. Mass.:33081.70
Organism:Bos taurus
Description:ChEMBL_65923
Residue:298
Component 4
Name:ATP synthase subunit delta, mitochondrial
Synonyms:ATP5D ATPD_BOVIN | F-ATPase delta subunit
Type:PROTEIN
Mol. Mass.:17608.84
Organism:Bos taurus
Description:EBI_100264
Residue:168
BDBM50404308
NameBDBM50404308
Synonyms:CHEMBL266555
TypeSmall organic molecule
Emp. Form.C28H29FN4O2S
Mol. Mass.504.619
SMILESCc1ncc(CN2C(CCc3ccccc3)CN(Cc3ccccc23)S(=O)(=O)c2ccc(F)cc2)[nH]1