Reaction Details
TargetProstaglandin E2 receptor EP4 subtype
LigandBDBM50142482
Substrate/Competitorn/a
Meas. Tech.ChEBML_158452
EC50 12±n/a nM
Citation Elworthy, TRKertesz, DJKim, WRoepel, MGQuattrocchio-Setti, LSmith, DBTracy, JLChow, ALi, FBrill, ERLach, LKMcGee, DYang, DSChiou, SS Lactams as EP4 prostanoid receptor subtype selective agonists. Part 1: 2-Pyrrolidinones-stereochemical and lower side-chain optimization. Bioorg Med Chem Lett14:1655-9 (2004) 
 
Prostaglandin E2 receptor EP4 subtype
Name:Prostaglandin E2 receptor EP4 subtype
Type:Enzyme
Mol. Mass.:53134.53
Organism:Homo sapiens (Human)
Description:P35408
Residue:488
BDBM50142482
NameBDBM50142482
Synonyms:7-{(R)-2-[(E)-(S)-3-Hydroxy-4-(3-trifluoromethyl-phenyl)-but-1-enyl]-5-oxo-pyrrolidin-1-yl}-heptanoic acid | CHEMBL45008
TypeSmall organic molecule
Emp. Form.C22H28F3NO4
Mol. Mass.427.4572
SMILESO[C@@H](Cc1cccc(c1)C(F)(F)F)\C=C\[C@H]1CCC(=O)N1CCCCCCC(O)=O