Reaction Details
TargetProstaglandin E2 receptor EP2 subtype
LigandBDBM50125417
Substrate/Competitorn/a
Meas. Tech.ChEBML_158313
Ki 31000±n/a nM
Citation Elworthy, TRKertesz, DJKim, WRoepel, MGQuattrocchio-Setti, LSmith, DBTracy, JLChow, ALi, FBrill, ERLach, LKMcGee, DYang, DSChiou, SS Lactams as EP4 prostanoid receptor subtype selective agonists. Part 1: 2-Pyrrolidinones-stereochemical and lower side-chain optimization. Bioorg Med Chem Lett14:1655-9 (2004) 
 
Prostaglandin E2 receptor EP2 subtype
Name:Prostaglandin E2 receptor EP2 subtype
Type:Enzyme
Mol. Mass.:39775.71
Organism:Homo sapiens (Human)
Description:P43116
Residue:358
BDBM50125417
NameBDBM50125417
Synonyms:7-[(R)-2-((E)-3-Hydroxy-4-phenyl-but-1-enyl)-5-oxo-pyrrolidin-1-yl]-heptanoic acid | CHEMBL14359
TypeSmall organic molecule
Emp. Form.C21H29NO4
Mol. Mass.359.4593
SMILESOC(Cc1ccccc1)\C=C\[C@H]1CCC(=O)N1CCCCCCC(O)=O