Reaction Details
TargetDNA topoisomerase 1
LigandBDBM50142516
Substrate/Competitorn/a
Meas. Tech.ChEBML_54043
IC50>100000±n/a nM
Citation Abdel-Aziz, MMatsuda, KOtsuka, MUyeda, MOkawara, TSuzuki, K Inhibitory activities against topoisomerase I and II by polyhydroxybenzoyl amide derivatives and their structure-activity relationship. Bioorg Med Chem Lett14:1669-72 (2004) 
 
DNA topoisomerase 1
Name:DNA topoisomerase 1
Type:Enzyme
Mol. Mass.:90771.02
Organism:Homo sapiens (Human)
Description:P11387
Residue:765
BDBM50142516
NameBDBM50142516
Synonyms:Acetic acid 4-[3-(4-acetoxy-benzoylamino)-phenylcarbamoyl]-phenyl ester | CHEMBL296856
TypeSmall organic molecule
Emp. Form.C24H20N2O6
Mol. Mass.432.4254
SMILESCC(=O)Oc1ccc(cc1)C(=O)Nc1cccc(NC(=O)c2ccc(OC(C)=O)cc2)c1