Reaction Details
TargetDNA topoisomerase 1
LigandBDBM50142518
Substrate/Competitorn/a
Meas. Tech.ChEBML_54043
IC50>100000±n/a nM
Citation Abdel-Aziz, MMatsuda, KOtsuka, MUyeda, MOkawara, TSuzuki, K Inhibitory activities against topoisomerase I and II by polyhydroxybenzoyl amide derivatives and their structure-activity relationship. Bioorg Med Chem Lett14:1669-72 (2004) 
 
DNA topoisomerase 1
Name:DNA topoisomerase 1
Type:Enzyme
Mol. Mass.:90771.02
Organism:Homo sapiens (Human)
Description:P11387
Residue:765
BDBM50142518
NameBDBM50142518
Synonyms:Acetic acid 2-acetoxy-5-[4-(3,4-diacetoxy-benzoylamino)-phenylcarbamoyl]-phenyl ester | CHEMBL44680
TypeSmall organic molecule
Emp. Form.C28H24N2O10
Mol. Mass.548.4976
SMILESCC(=O)Oc1ccc(cc1OC(C)=O)C(=O)Nc1ccc(NC(=O)c2ccc(OC(C)=O)c(OC(C)=O)c2)cc1