Reaction Details
TargetDNA topoisomerase 1
LigandBDBM50142523
Substrate/Competitorn/a
Meas. Tech.ChEBML_54043
IC50 10000±n/a nM
Citation Abdel-Aziz, MMatsuda, KOtsuka, MUyeda, MOkawara, TSuzuki, K Inhibitory activities against topoisomerase I and II by polyhydroxybenzoyl amide derivatives and their structure-activity relationship. Bioorg Med Chem Lett14:1669-72 (2004) 
 
DNA topoisomerase 1
Name:DNA topoisomerase 1
Type:Enzyme
Mol. Mass.:90771.02
Organism:Homo sapiens (Human)
Description:P11387
Residue:765
BDBM50142523
NameBDBM50142523
Synonyms:CHEMBL297255 | N-[3-(3,4-dihydroxy-benzoylamino)-phenyl]-3,4-dihydroxy-benzamide
TypeSmall organic molecule
Emp. Form.C20H16N2O6
Mol. Mass.380.3508
SMILESOc1ccc(cc1O)C(=O)Nc1cccc(NC(=O)c2ccc(O)c(O)c2)c1