Reaction Details
TargetDNA topoisomerase 2-alpha/2-beta
LigandBDBM50142507
Substrate/Competitorn/a
Meas. Tech.ChEMBL_54377 (CHEMBL666727)
IC50 220±n/a nM
Citation Abdel-Aziz, MMatsuda, KOtsuka, MUyeda, MOkawara, TSuzuki, K Inhibitory activities against topoisomerase I and II by polyhydroxybenzoyl amide derivatives and their structure-activity relationship. Bioorg Med Chem Lett14:1669-72 (2004) 
 
DNA topoisomerase 2-alpha/2-beta
Name:DNA topoisomerase 2-alpha/2-beta
Synonyms:DNA topoisomerase II
Type:n/a
Mol. Mass.:n/a
Description:ASSAY_ID of ChEMBL is 1821483
Components:This complex has 2 components.
Component 1
Name:DNA topoisomerase 2-alpha
Type:Protein
Mol. Mass.:174415.30
Organism:Homo sapiens (Human)
Description:P11388
Residue:1531
Component 2
Name:DNA topoisomerase 2-beta
Synonyms:DNA topoisomerase II TOP2B | TOP2B_HUMAN
Type:PROTEIN
Mol. Mass.:183284.13
Organism:Homo sapiens (Human)
Description:ChEMBL_51583
Residue:1626
BDBM50142507
NameBDBM50142507
Synonyms:CHEMBL47526 | N-[3-(3,4,5-triihydroxy-benzoylamino)-phenyl]-3,4,5-trihydroxy-benzamide
TypeSmall organic molecule
Emp. Form.C20H16N2O8
Mol. Mass.412.3496
SMILESOc1cc(cc(O)c1O)C(=O)Nc1cccc(NC(=O)c2cc(O)c(O)c(O)c2)c1