Reaction Details
TargetGamma-aminobutyric acid receptor subunit alpha-5
LigandBDBM50142570
Substrate/Competitorn/a
Meas. Tech.ChEBML_68415
Ki 33±n/a nM
Citation Crawforth, JAtack, JRCook, SMGibson, KRNadin, AOwens, APPike, ARowley, MSmith, AJSohal, BSternfeld, FWafford, KStreet, LJ Tricyclic pyridones as functionally selective human GABAA alpha 2/3 receptor-ion channel ligands. Bioorg Med Chem Lett14:1679-82 (2004) 
 
Gamma-aminobutyric acid receptor subunit alpha-5
Name:Gamma-aminobutyric acid receptor subunit alpha-5
Type:Enzyme
Mol. Mass.:52160.59
Organism:Homo sapiens (Human)
Description:P31644
Residue:462
BDBM50142570
NameBDBM50142570
Synonyms:9-(4-Methyl-thiazol-2-yl)-11-pyridin-4-yl-6,7-dihydro-5H-2,7a-diaza-dibenzo[a,c]cyclohepten-8-one | CHEMBL45198
TypeSmall organic molecule
Emp. Form.C22H18N4OS
Mol. Mass.386.47
SMILESCc1csc(n1)-c1cc(-c2ccncc2)c2-c3cnccc3CCCn2c1=O