Reaction Details
TargetNeuronal acetylcholine receptor subunit alpha-4/beta-2
LigandBDBM50143304
Substrate/Competitorn/a
Meas. Tech.ChEMBL_177560 (CHEMBL784318)
IC50 170±n/a nM
Citation Crooks, PAAyers, JTXu, RSumithran, SPGrinevich, VPWilkins, LHDeaciuc, AGAllen, DDDwoskin, LP Development of subtype-selective ligands as antagonists at nicotinic receptors mediating nicotine-evoked dopamine release. Bioorg Med Chem Lett14:1869-74 (2004) 
 
Neuronal acetylcholine receptor subunit alpha-4/beta-2
Name:Neuronal acetylcholine receptor subunit alpha-4/beta-2
Type:n/a
Mol. Mass.:n/a
Description:n/a
Components:This complex has 0 components.
Component 1
Name:Neuronal acetylcholine receptor subunit alpha-4
Synonyms:ACHA4_RAT Cholinergic, Nicotinic Alpha4Beta2 Chrna4 Neuronal acetylcholine receptor (alpha4beta2 nAChR) Neuronal acetylcholine receptor subunit alpha 4 beta 2 | Neuronal acetylcholine receptor subunit alpha-4
Type:Enzyme
Mol. Mass.:70196.44
Organism:Rattus norvegicus (Rat)
Description:P09483
Residue:630
Component 2
Name:Neuronal acetylcholine receptor subunit beta-2
Synonyms:ACHB2_RAT Chrnb2 Neuronal acetylcholine receptor non-alpha-1 chain
Type:Enzyme
Mol. Mass.:56910.32
Organism:Rattus norvegicus (Rat)
Description:P12390
Residue:500
BDBM50143304
NameBDBM50143304
Synonyms:3-(1-methylpyrrolidin-2-yl)-1-[6-(3-(1-methylpyrrolidin-2-yl)pyridinium-1-yl)tetradecyl]pyridinium; Dibromide | CHEMBL54826
TypeSmall organic molecule
Emp. Form.C34H56N4
Mol. Mass.520.8341
SMILESCN1CCC[C@H]1c1ccc[n+](CCCCCCCCCCCCCC[n+]2cccc(c2)[C@@H]2CCCN2C)c1