Reaction Details
TargetNeuronal acetylcholine receptor subunit alpha-4
LigandBDBM50143313
Substrate/Competitorn/a
Meas. Tech.ChEBML_143888
IC50 3.7±n/a nM
Citation Almeida, LEPereira, EFCamara, ALMaelicke, AAlbuquerque, EX Sensitivity of neuronal nicotinic acetylcholine receptors to the opiate antagonists naltrexone and naloxone: receptor blockade and up-regulation. Bioorg Med Chem Lett14:1879-87 (2004) 
 
Neuronal acetylcholine receptor subunit alpha-4
Name:Neuronal acetylcholine receptor subunit alpha-4
Type:Enzyme
Mol. Mass.:70196.44
Organism:Rattus norvegicus (Rat)
Description:P09483
Residue:630
BDBM50143313
NameBDBM50143313
Synonyms:(12S,13aS)-12-Methoxy-1,4,5,6,9,11,12,13-octahydro-8H-pyrano[4',3':3,4]pyrido[2,1-i]indol-2-one DHbetaE
TypeSmall organic molecule
Emp. Form.C16H21NO3
Mol. Mass.275.3428
SMILESCO[C@H]1CC=C2CCN3CCC4=C(CC(=O)OC4)[C@]23C1