Reaction Details
TargetNeuronal acetylcholine receptor subunit alpha-4/beta-4
LigandBDBM50100715
Substrate/Competitorn/a
Meas. Tech.ChEMBL_144014 (CHEMBL750429)
EC50 20±n/a nM
Citation Carroll, FI Epibatidine structure-activity relationships. Bioorg Med Chem Lett14:1889-96 (2004) 
 
Neuronal acetylcholine receptor subunit alpha-4/beta-4
Name:Neuronal acetylcholine receptor subunit alpha-4/beta-4
Type:n/a
Mol. Mass.:n/a
Description:ASSAY_ID of EBI is 144014
Components:This complex has 2 components.
Component 1
Name:Neuronal acetylcholine receptor subunit alpha-4
Synonyms:ACHA4_RAT Cholinergic, Nicotinic Alpha4Beta2 Chrna4 Neuronal acetylcholine receptor (alpha4beta2 nAChR) Neuronal acetylcholine receptor subunit alpha 4 beta 2 | Neuronal acetylcholine receptor subunit alpha-4
Type:Enzyme
Mol. Mass.:70196.44
Organism:Rattus norvegicus (Rat)
Description:P09483
Residue:630
Component 2
Name:Neuronal acetylcholine receptor subunit beta-4
Synonyms:ACHB4_RAT Chrnb4 Neuronal acetylcholine receptor non-alpha-2 chain | Neuronal acetylcholine receptor protein beta-4 subunit
Type:Enzyme
Mol. Mass.:55863.89
Organism:Rattus norvegicus (Rat)
Description:P12392
Residue:495
BDBM50100715
NameBDBM50100715
Synonyms:2-(6-Bromo-pyridin-3-yl)-7-aza-bicyclo[2.2.1]heptane | CHEMBL301901
TypeSmall organic molecule
Emp. Form.C11H13BrN2
Mol. Mass.253.138
SMILESBrc1ccc(cn1)C1CC2CCC1N2