Reaction Details
TargetNeuronal acetylcholine receptor subunit alpha-4/beta-2
LigandBDBM50049757
Substrate/Competitorn/a
Meas. Tech.ChEMBL_143854 (CHEMBL747211)
Ki 0.030±n/a nM
Citation Carroll, FI Epibatidine structure-activity relationships. Bioorg Med Chem Lett14:1889-96 (2004) 
 
Neuronal acetylcholine receptor subunit alpha-4/beta-2
Name:Neuronal acetylcholine receptor subunit alpha-4/beta-2
Type:n/a
Mol. Mass.:n/a
Description:n/a
Components:This complex has 0 components.
Component 1
Name:Neuronal acetylcholine receptor subunit alpha-4
Synonyms:ACHA4_RAT Cholinergic, Nicotinic Alpha4Beta2 Chrna4 Neuronal acetylcholine receptor (alpha4beta2 nAChR) Neuronal acetylcholine receptor subunit alpha 4 beta 2 | Neuronal acetylcholine receptor subunit alpha-4
Type:Enzyme
Mol. Mass.:70196.44
Organism:Rattus norvegicus (Rat)
Description:P09483
Residue:630
Component 2
Name:Neuronal acetylcholine receptor subunit beta-2
Synonyms:ACHB2_RAT Chrnb2 Neuronal acetylcholine receptor non-alpha-1 chain
Type:Enzyme
Mol. Mass.:56910.32
Organism:Rattus norvegicus (Rat)
Description:P12390
Residue:500
BDBM50049757
NameBDBM50049757
Synonyms:()-2-(6-Chloro-pyridin-3-yl)-7-aza-bicyclo[2.2.1]heptane (+)-epibatidine (1R,2R,4S)-epibatidine (2R,4S)-2-(6-Chloro-pyridin-3-yl)-7-aza-bicyclo[2.2.1]heptane (2R,4S)-2-(6-chloropyridin-3-yl)-7-aza-bicyclo[2.2.1]heptane (R)-2-(6-Chloro-pyridin-3-yl)-7-methyl-7-aza-bicyclo[2.2.1]heptane 2-(6-Chloro-pyridin-3-yl)-7-aza-bicyclo[2.2.1]heptane 2-(6-Chloro-pyridin-3-yl)-7-aza-bicyclo[2.2.1]heptane(+/-) epibatidine 2-(6-Chloro-pyridin-3-yl)-7-azonia-bicyclo[2.2.1]heptane 2-Pyridin-3-yl-7-aza-bicyclo[2.2.1]heptane EPIBATIDINE Epibatidine-(+) exo-2-(6-chloropyridin-3-yl)-7-aza-bicyclo[2.2.1]heptane | rac-(2R)-2-(6-chloropyridin-3-yl)-7-aza-bicyclo[2.2.1]heptane
TypeSmall organic molecule
Emp. Form.C11H13ClN2
Mol. Mass.208.687
SMILESClc1ccc(cn1)C1CC2CCC1N2