Reaction Details
TargetNeuronal acetylcholine receptor subunit alpha-4/beta-2
LigandBDBM50100711
Substrate/Competitorn/a
Meas. Tech.ChEMBL_143854 (CHEMBL747211)
Ki>100.0±n/a nM
Citation Carroll, FI Epibatidine structure-activity relationships. Bioorg Med Chem Lett14:1889-96 (2004) 
 
Neuronal acetylcholine receptor subunit alpha-4/beta-2
Name:Neuronal acetylcholine receptor subunit alpha-4/beta-2
Type:n/a
Mol. Mass.:n/a
Description:n/a
Components:This complex has 0 components.
Component 1
Name:Neuronal acetylcholine receptor subunit alpha-4
Synonyms:ACHA4_RAT Cholinergic, Nicotinic Alpha4Beta2 Chrna4 Neuronal acetylcholine receptor (alpha4beta2 nAChR) Neuronal acetylcholine receptor subunit alpha 4 beta 2 | Neuronal acetylcholine receptor subunit alpha-4
Type:Enzyme
Mol. Mass.:70196.44
Organism:Rattus norvegicus (Rat)
Description:P09483
Residue:630
Component 2
Name:Neuronal acetylcholine receptor subunit beta-2
Synonyms:ACHB2_RAT Chrnb2 Neuronal acetylcholine receptor non-alpha-1 chain
Type:Enzyme
Mol. Mass.:56910.32
Organism:Rattus norvegicus (Rat)
Description:P12390
Residue:500
BDBM50100711
NameBDBM50100711
Synonyms:CHEMBL56677 | [5-(7-Aza-bicyclo[2.2.1]hept-2-yl)-pyridin-2-yl]-dimethyl-amine
TypeSmall organic molecule
Emp. Form.C13H19N3
Mol. Mass.217.3101
SMILESCN(C)c1ccc(cn1)C1CC2CCC1N2