Reaction Details
TargetNeuronal acetylcholine receptor subunit alpha-4/beta-2
LigandBDBM50143325
Substrate/Competitorn/a
Meas. Tech.ChEMBL_143873 (CHEMBL751229)
Ki 14±n/a nM
Citation Carroll, FI Epibatidine structure-activity relationships. Bioorg Med Chem Lett14:1889-96 (2004) 
 
Neuronal acetylcholine receptor subunit alpha-4/beta-2
Name:Neuronal acetylcholine receptor subunit alpha-4/beta-2
Type:n/a
Mol. Mass.:n/a
Description:n/a
Components:This complex has 0 components.
Component 1
Name:Neuronal acetylcholine receptor subunit alpha-4
Synonyms:ACHA4_RAT Cholinergic, Nicotinic Alpha4Beta2 Chrna4 Neuronal acetylcholine receptor (alpha4beta2 nAChR) Neuronal acetylcholine receptor subunit alpha 4 beta 2 | Neuronal acetylcholine receptor subunit alpha-4
Type:Enzyme
Mol. Mass.:70196.44
Organism:Rattus norvegicus (Rat)
Description:P09483
Residue:630
Component 2
Name:Neuronal acetylcholine receptor subunit beta-2
Synonyms:ACHB2_RAT Chrnb2 Neuronal acetylcholine receptor non-alpha-1 chain
Type:Enzyme
Mol. Mass.:56910.32
Organism:Rattus norvegicus (Rat)
Description:P12390
Residue:500
BDBM50143325
NameBDBM50143325
Synonyms:2-(6-Chloro-pyridin-3-yl)-7-ethyl-7-aza-bicyclo[2.2.1]heptane | CHEMBL57395
TypeSmall organic molecule
Emp. Form.C13H17ClN2
Mol. Mass.236.74
SMILESCCN1C2CCC1C(C2)c1ccc(Cl)nc1