Reaction Details
TargetVoltage-dependent calcium channel subunit alpha-2/delta-1
LigandBDBM50143348
Substrate/Competitorn/a
Meas. Tech.ChEBML_32526
IC50 52±n/a nM
Citation Lim, JStock, NPracitto, RBoueres, JKMunoz, BChaudhary, ASantini, AMOrr, KSchaffhauser, HBezverkov, REAiyar, JVenkatraman, S N-Acridin-9-yl-butane-1,4-diamine derivatives: high-affinity ligands of the alpha2delta subunit of voltage gated calcium channels. Bioorg Med Chem Lett14:1913-6 (2004) 
 
Voltage-dependent calcium channel subunit alpha-2/delta-1
Name:Voltage-dependent calcium channel subunit alpha-2/delta-1
Type:Enzyme
Mol. Mass.:124544.88
Organism:Homo sapiens (Human)
Description:P54289
Residue:1103
BDBM50143348
NameBDBM50143348
Synonyms:CHEMBL299461 | N*1*-Acridin-9-yl-1-cyclopropyl-N*4*,N*4*-diethyl-butane-1,4-diamine
TypeSmall organic molecule
Emp. Form.C24H31N3
Mol. Mass.361.523
SMILESCCN(CC)CCCC(Nc1c2ccccc2nc2ccccc12)C1CC1