Reaction Details
TargetVoltage-dependent calcium channel subunit alpha-2/delta-1
LigandBDBM50080153
Substrate/Competitorn/a
Meas. Tech.ChEBML_32526
IC50 27±n/a nM
Citation Lim, JStock, NPracitto, RBoueres, JKMunoz, BChaudhary, ASantini, AMOrr, KSchaffhauser, HBezverkov, REAiyar, JVenkatraman, S N-Acridin-9-yl-butane-1,4-diamine derivatives: high-affinity ligands of the alpha2delta subunit of voltage gated calcium channels. Bioorg Med Chem Lett14:1913-6 (2004) 
 
Voltage-dependent calcium channel subunit alpha-2/delta-1
Name:Voltage-dependent calcium channel subunit alpha-2/delta-1
Type:Enzyme
Mol. Mass.:124544.88
Organism:Homo sapiens (Human)
Description:P54289
Residue:1103
BDBM50080153
NameBDBM50080153
Synonyms:(1-Aminomethyl-cyclohexyl)-acetic acid CHEMBL940 GABAPENTIN Neurontin | [1-(AMINOMETHYL)CYCLOHEXYL]ACETIC ACID
TypeSmall organic molecule
Emp. Form.C9H17NO2
Mol. Mass.171.2368
SMILESNCC1(CC(O)=O)CCCCC1