Reaction Details
TargetVoltage-dependent calcium channel subunit alpha-2/delta-1
LigandBDBM50143362
Substrate/Competitorn/a
Meas. Tech.ChEBML_32526
IC50 9900±n/a nM
Citation Lim, JStock, NPracitto, RBoueres, JKMunoz, BChaudhary, ASantini, AMOrr, KSchaffhauser, HBezverkov, REAiyar, JVenkatraman, S N-Acridin-9-yl-butane-1,4-diamine derivatives: high-affinity ligands of the alpha2delta subunit of voltage gated calcium channels. Bioorg Med Chem Lett14:1913-6 (2004) 
 
Voltage-dependent calcium channel subunit alpha-2/delta-1
Name:Voltage-dependent calcium channel subunit alpha-2/delta-1
Type:Enzyme
Mol. Mass.:124544.88
Organism:Homo sapiens (Human)
Description:P54289
Residue:1103
BDBM50143362
NameBDBM50143362
Synonyms:Acridin-9-yl-(1-methyl-4-pyrrolidin-1-yl-butyl)-amine | CHEMBL299681
TypeSmall organic molecule
Emp. Form.C22H27N3
Mol. Mass.333.4699
SMILESCC(CCCN1CCCC1)Nc1c2ccccc2nc2ccccc12