Reaction Details
TargetVoltage-dependent calcium channel subunit alpha-2/delta-1
LigandBDBM50143366
Substrate/Competitorn/a
Meas. Tech.ChEBML_32526
IC50 5100±n/a nM
Citation Lim, JStock, NPracitto, RBoueres, JKMunoz, BChaudhary, ASantini, AMOrr, KSchaffhauser, HBezverkov, REAiyar, JVenkatraman, S N-Acridin-9-yl-butane-1,4-diamine derivatives: high-affinity ligands of the alpha2delta subunit of voltage gated calcium channels. Bioorg Med Chem Lett14:1913-6 (2004) 
 
Voltage-dependent calcium channel subunit alpha-2/delta-1
Name:Voltage-dependent calcium channel subunit alpha-2/delta-1
Type:Enzyme
Mol. Mass.:124544.88
Organism:Homo sapiens (Human)
Description:P54289
Residue:1103
BDBM50143366
NameBDBM50143366
Synonyms:CHEMBL56754 | N*4*-Acridin-9-yl-N*1*-isopropyl-pentane-1,4-diamine
TypeSmall organic molecule
Emp. Form.C21H27N3
Mol. Mass.321.4592
SMILESCC(C)NCCCC(C)Nc1c2ccccc2nc2ccccc12