Reaction Details
TargetGenome polyprotein/Non-structural protein 4A
LigandBDBM50141219
Substrate/Competitorn/a
Meas. Tech.ChEMBL_143636 (CHEMBL752796)
Ki 920±n/a nM
Citation Perni, RBFarmer, LJCottrell, KMCourt, JJCourtney, LFDeininger, DDGates, CAHarbeson, SLKim, JLLin, CLin, KLuong, YPMaxwell, JPMurcko, MAPitlik, JRao, BGSchairer, WCTung, RDVan Drie, JHWilson, KThomson, JA Inhibitors of hepatitis C virus NS3.4A protease. Part 3: P2 proline variants. Bioorg Med Chem Lett14:1939-42 (2004) 
 
Genome polyprotein/Non-structural protein 4A
Name:Genome polyprotein/Non-structural protein 4A
Synonyms:Hepatitis C virus serine protease, NS3/NS4A
Type:n/a
Mol. Mass.:n/a
Description:ASSAY_ID of ChEMBL is 1969955
Components:This complex has 2 components.
Component 1
Name:Non-structural protein 4A
Type:PROTEIN
Mol. Mass.:5762.65
Organism:Hepatitis C virus
Description:ChEMBL_305334
Residue:54
Component 2
Name:Genome polyprotein
Synonyms:Hepatitis C virus NS3 protease/helicase | Hepatitis C virus serine protease, NS3/NS4A
Type:Protein
Mol. Mass.:67067.41
Organism:Hepatitis C virus
Description:A3EZI9
Residue:631
BDBM50141219
NameBDBM50141219
Synonyms:CHEMBL407433 | Pyrazine-2-carboxylic acid [(R)-1-((R)-1-{(S)-4-benzyloxy-2-[(R)-1-((S)-(S)-1-phenyl-ethylaminooxalyl)-propylcarbamoyl]-pyrrolidine-1-carbonyl}-2-methyl-propylcarbamoyl)-2-methyl-propyl]-amide
TypeSmall organic molecule
Emp. Form.C40H51N7O7
Mol. Mass.741.8756
SMILESCC[C@H](NC(=O)[C@@H]1C[C@H](CN1C(=O)[C@H](NC(=O)[C@H](NC(=O)c1cnccn1)C(C)C)C(C)C)OCc1ccccc1)C(=O)C(=O)N[C@@H](C)c1ccccc1