Reaction Details
TargetDNA nucleotidylexotransferase
LigandBDBM50143523
Substrate/Competitorn/a
Meas. Tech.ChEBML_210231
IC50 129000±n/a nM
Citation Saito, FTakeuchi, RKamino, TKuramochi, KSugawara, FSakaguchi, KKobayashi, S Structure-activity relationships of untenone A and its derivatives for inhibition of DNA polymerases. Bioorg Med Chem Lett14:1975-7 (2004) 
 
DNA nucleotidylexotransferase
Name:DNA nucleotidylexotransferase
Type:PROTEIN
Mol. Mass.:58545.66
Organism:Homo sapiens (Human)
Description:ChEMBL_210231
Residue:509
BDBM50143523
NameBDBM50143523
Synonyms:2-Hexadecyl-5-oxo-cyclopent-1-enecarboxylic acid methyl ester | CHEMBL174755
TypeSmall organic molecule
Emp. Form.C23H40O3
Mol. Mass.364.5619
1=C(C(=O)OC)C(=O)CC1