Reaction Details
TargetPotassium voltage-gated channel subfamily KQT member 2
LigandBDBM50143560
Substrate/Competitorn/a
Meas. Tech.ChEBML_91716
EC50 60±n/a nM
Citation Wu, YJBoissard, CGChen, JFitzpatrick, WGao, QGribkoff, VKHarden, DGHe, HKnox, RJNatale, JPieschl, RLStarrett, JESun, LQThompson, MWeaver, DWu, DDworetzky, SI (S)-N-[1-(4-cyclopropylmethyl-3,4-dihydro-2H-benzo[1,4]oxazin-6-yl)-ethyl]-3-(2-fluoro-phenyl)-acrylamide is a potent and efficacious KCNQ2 opener which inhibits induced hyperexcitability of rat hippocampal neurons. Bioorg Med Chem Lett14:1991-5 (2004) 
 
Potassium voltage-gated channel subfamily KQT member 2
Name:Potassium voltage-gated channel subfamily KQT member 2
Type:PROTEIN
Mol. Mass.:84494.02
Organism:Mus musculus
Description:ChEMBL_990142
Residue:759
BDBM50143560
NameBDBM50143560
Synonyms:(E)-N-[(S)-1-(4-Cyclopropylmethyl-3,4-dihydro-2H-benzo[1,4]oxazin-6-yl)-ethyl]-3-(2-fluoro-phenyl)-acrylamide CHEMBL176931 | N-[1-(4-Cyclopropylmethyl-3,4-dihydro-2H-benzo[1,4]oxazin-6-yl)-ethyl]-3-(2-fluoro-phenyl)-acrylamide
TypeSmall organic molecule
Emp. Form.C23H25FN2O2
Mol. Mass.380.4552
SMILESC[C@H](NC(=O)\C=C\c1ccccc1F)c1ccc2OCCN(CC3CC3)c2c1