Reaction Details
TargetAdenosine kinase
LigandBDBM50143574
Substrate/Competitorn/a
Meas. Tech.ChEBML_31117
IC50 1±n/a nM
Citation Bauser, MDelapierre, GHauswald, MFlessner, TD'Urso, DHermann, ABeyreuther, BDe Vry, JSpreyer, PReissmüller, EMeier, H Discovery and optimization of 2-aryl oxazolo-pyrimidines as adenosine kinase inhibitors using liquid phase parallel synthesis. Bioorg Med Chem Lett14:1997-2000 (2004) 
 
Adenosine kinase
Name:Adenosine kinase
Type:PROTEIN
Mol. Mass.:40545.97
Organism:Homo sapiens (Human)
Description:ChEMBL_1467841
Residue:362
BDBM50143574
NameBDBM50143574
Synonyms:7-((4aS,7aS)-6-Benzyl-octahydro-pyrrolo[3,4-b]pyridin-1-yl)-2-phenyl-oxazolo[5,4-d]pyrimidine | CHEMBL174158
TypeSmall organic molecule
Emp. Form.C25H25N5O
Mol. Mass.411.4989
SMILESC(N1C[C@@H]2CCCN([C@@H]2C1)c1ncnc2oc(nc12)-c1ccccc1)c1ccccc1