Reaction Details
TargetAdenosine kinase
LigandBDBM50143575
Substrate/Competitorn/a
Meas. Tech.ChEBML_31117
IC50>1±n/a nM
Citation Bauser, MDelapierre, GHauswald, MFlessner, TD'Urso, DHermann, ABeyreuther, BDe Vry, JSpreyer, PReissmüller, EMeier, H Discovery and optimization of 2-aryl oxazolo-pyrimidines as adenosine kinase inhibitors using liquid phase parallel synthesis. Bioorg Med Chem Lett14:1997-2000 (2004) 
 
Adenosine kinase
Name:Adenosine kinase
Type:PROTEIN
Mol. Mass.:40545.97
Organism:Homo sapiens (Human)
Description:ChEMBL_1467841
Residue:362
BDBM50143575
NameBDBM50143575
Synonyms:7-(1-Benzyl-hexahydro-pyrrolo[3,4-b]pyrrol-5-yl)-2-pyridin-4-yl-oxazolo[5,4-d]pyrimidine | CHEMBL369374
TypeSmall organic molecule
Emp. Form.C23H22N6O
Mol. Mass.398.4604
SMILESC(N1CCC2CN(CC12)c1ncnc2oc(nc12)-c1ccncc1)c1ccccc1