Reaction Details
TargetAdenosine kinase
LigandBDBM50143581
Substrate/Competitorn/a
Meas. Tech.ChEBML_31117
IC50>1±n/a nM
Citation Bauser, MDelapierre, GHauswald, MFlessner, TD'Urso, DHermann, ABeyreuther, BDe Vry, JSpreyer, PReissmüller, EMeier, H Discovery and optimization of 2-aryl oxazolo-pyrimidines as adenosine kinase inhibitors using liquid phase parallel synthesis. Bioorg Med Chem Lett14:1997-2000 (2004) 
 
Adenosine kinase
Name:Adenosine kinase
Type:PROTEIN
Mol. Mass.:40545.97
Organism:Homo sapiens (Human)
Description:ChEMBL_1467841
Residue:362
BDBM50143581
NameBDBM50143581
Synonyms:7-[4-(4-Fluoro-benzyl)-[1,4]diazepan-1-yl]-2-phenyl-oxazolo[5,4-d]pyrimidine | CHEMBL366908
TypeSmall organic molecule
Emp. Form.C23H22FN5O
Mol. Mass.403.4521
SMILESFc1ccc(CN2CCCN(CC2)c2ncnc3oc(nc23)-c2ccccc2)cc1