Reaction Details
TargetLegumain
LigandBDBM50292159
Substrate/Competitorn/a
Meas. Tech.ChEMBL_96918 (CHEMBL707897)
IC50 1000±n/a nM
Citation Ekici, ODGötz, MGJames, KELi, ZZRukamp, BJAsgian, JLCaffrey, CRHansell, EDvorák, JMcKerrow, JHPotempa, JTravis, JMikolajczyk, JSalvesen, GSPowers, JC Aza-peptide Michael acceptors: a new class of inhibitors specific for caspases and other clan CD cysteine proteases. J Med Chem47:1889-92 (2004) 
 
Legumain
Name:Legumain
Type:n/a
Mol. Mass.:49411.12
Organism:Homo sapiens (Human)
Description:n/a
Residue:433
BDBM50292159
NameBDBM50292159
Synonyms:(S)-N'-[(S)-2-((S)-2-Benzyloxycarbonylamino-propionylamino)-propionyl]-N-carbamoylmethyl-hydrazinecarboxylic acid 2-benzylcarbamoyl-vinyl ester | CHEMBL55249
TypeSmall organic molecule
Emp. Form.C27H32N6O8
Mol. Mass.568.5784
SMILESC[C@H](NC(=O)OCc1ccccc1)C(=O)N[C@@H](C)C(=O)NN(CC(N)=O)C(=O)O\C=C\C(=O)NCc1ccccc1