Reaction Details
TargetCapsid scaffolding protein
LigandBDBM50143619
Substrate/Competitorn/a
Meas. Tech.ChEMBL_77299 (CHEMBL687228)
IC50 15±n/a nM
Citation Gopalsamy, ALim, KEllingboe, JWMitsner, BNikitenko, AUpeslacis, JMansour, TSOlson, MWBebernitz, GAGrinberg, DFeld, BMoy, FJO'Connell, J Design and syntheses of 1,6-naphthalene derivatives as selective HCMV protease inhibitors. J Med Chem47:1893-9 (2004) 
 
Capsid scaffolding protein
Name:Capsid scaffolding protein
Type:PROTEIN
Mol. Mass.:73854.16
Organism:Human cytomegalovirus (strain AD169) (HHV-5) (Human herpesvirus 5)
Description:ChEMBL_158958
Residue:708
BDBM50143619
NameBDBM50143619
Synonyms:C,C,C-Trifluoro-N-[5-(2-naphthalen-2-yl-vinyl)-naphthalen-2-yl]-methanesulfonamide | CHEMBL56516
TypeSmall organic molecule
Emp. Form.C23H16F3NO2S
Mol. Mass.427.439
SMILESFC(F)(F)S(=O)(=O)Nc1ccc2c(\C=C\c3ccc4ccccc4c3)cccc2c1