Reaction Details
TargetCapsid scaffolding protein
LigandBDBM50143624
Substrate/Competitorn/a
Meas. Tech.ChEMBL_77299 (CHEMBL687228)
IC50>50±n/a nM
Citation Gopalsamy, ALim, KEllingboe, JWMitsner, BNikitenko, AUpeslacis, JMansour, TSOlson, MWBebernitz, GAGrinberg, DFeld, BMoy, FJO'Connell, J Design and syntheses of 1,6-naphthalene derivatives as selective HCMV protease inhibitors. J Med Chem47:1893-9 (2004) 
 
Capsid scaffolding protein
Name:Capsid scaffolding protein
Type:PROTEIN
Mol. Mass.:73854.16
Organism:Human cytomegalovirus (strain AD169) (HHV-5) (Human herpesvirus 5)
Description:ChEMBL_158958
Residue:708
BDBM50143624
NameBDBM50143624
Synonyms:CHEMBL56020 | N-{5-[(E)-2-(6-Chloro-quinolin-2-yl)-vinyl]-naphthalen-2-yl}-C,C,C-trifluoro-N-methyl-methanesulfonamide
TypeSmall organic molecule
Emp. Form.C23H16ClF3N2O2S
Mol. Mass.476.899
SMILESCN(c1ccc2c(\C=C\c3ccc4cc(Cl)ccc4n3)cccc2c1)S(=O)(=O)C(F)(F)F