Reaction Details
TargetCapsid scaffolding protein
LigandBDBM50143629
Substrate/Competitorn/a
Meas. Tech.ChEMBL_77299 (CHEMBL687228)
IC50 7.4±n/a nM
Citation Gopalsamy, ALim, KEllingboe, JWMitsner, BNikitenko, AUpeslacis, JMansour, TSOlson, MWBebernitz, GAGrinberg, DFeld, BMoy, FJO'Connell, J Design and syntheses of 1,6-naphthalene derivatives as selective HCMV protease inhibitors. J Med Chem47:1893-9 (2004) 
 
Capsid scaffolding protein
Name:Capsid scaffolding protein
Type:PROTEIN
Mol. Mass.:73854.16
Organism:Human cytomegalovirus (strain AD169) (HHV-5) (Human herpesvirus 5)
Description:ChEMBL_158958
Residue:708
BDBM50143629
NameBDBM50143629
Synonyms:CHEMBL57465 | N-[5-(3-Trifluoromethyl-benzyloxy)-naphthalen-2-yl]-terephthalamic acid
TypeSmall organic molecule
Emp. Form.C26H18F3NO4
Mol. Mass.465.4206
SMILESOC(=O)c1ccc(cc1)C(=O)Nc1ccc2c(OCc3cccc(c3)C(F)(F)F)cccc2c1