Reaction Details
TargetCapsid scaffolding protein
LigandBDBM50143634
Substrate/Competitorn/a
Meas. Tech.ChEMBL_77299 (CHEMBL687228)
IC50 2.8±n/a nM
Citation Gopalsamy, ALim, KEllingboe, JWMitsner, BNikitenko, AUpeslacis, JMansour, TSOlson, MWBebernitz, GAGrinberg, DFeld, BMoy, FJO'Connell, J Design and syntheses of 1,6-naphthalene derivatives as selective HCMV protease inhibitors. J Med Chem47:1893-9 (2004) 
 
Capsid scaffolding protein
Name:Capsid scaffolding protein
Type:PROTEIN
Mol. Mass.:73854.16
Organism:Human cytomegalovirus (strain AD169) (HHV-5) (Human herpesvirus 5)
Description:ChEMBL_158958
Residue:708
BDBM50143634
NameBDBM50143634
Synonyms:4-{[5-(4-Bromo-phenoxymethyl)-naphthalen-2-ylamino]-methyl}-benzoic acid | CHEMBL293262
TypeSmall organic molecule
Emp. Form.C25H20BrNO3
Mol. Mass.462.335
SMILESOC(=O)c1ccc(CNc2ccc3c(COc4ccc(Br)cc4)cccc3c2)cc1