Reaction Details
TargetAlpha-1D adrenergic receptor
LigandBDBM50143697
Substrate/Competitorn/a
Meas. Tech.ChEMBL_32721 (CHEMBL645993)
Ki 0.13±n/a nM
Citation Leonardi, ABarlocco, DMontesano, FCignarella, GMotta, GTesta, RPoggesi, ESeeber, MDe Benedetti, PGFanelli, F Synthesis, screening, and molecular modeling of new potent and selective antagonists at the alpha 1d adrenergic receptor. J Med Chem47:1900-18 (2004) 
 
Alpha-1D adrenergic receptor
Name:Alpha-1D adrenergic receptor
Type:Protein
Mol. Mass.:59375.97
Organism:Rattus norvegicus (Rat)
Description:P23944
Residue:561
BDBM50143697
NameBDBM50143697
Synonyms:8-{2-[4-(2,5-Dichloro-phenyl)-piperazin-1-yl]-ethyl}-8-aza-spiro[4.5]decane-7,9-dione | CHEMBL56438
TypeSmall organic molecule
Emp. Form.C21H27Cl2N3O2
Mol. Mass.424.364
SMILESClc1ccc(Cl)c(c1)N1CCN(CCN2C(=O)CC3(CCCC3)CC2=O)CC1