Reaction Details
TargetMatrix metalloproteinase-9
LigandBDBM50143732
Substrate/Competitorn/a
Meas. Tech.ChEMBL_105384 (CHEMBL710803)
Ki 7.4±n/a nM
Citation Moriyama, HTsukida, TInoue, YYokota, KYoshino, KKondo, HMiura, NNishimura, S Azasugar-based MMP/ADAM inhibitors as antipsoriatic agents. J Med Chem47:1930-8 (2004) 
 
Matrix metalloproteinase-9
Name:Matrix metalloproteinase-9
Type:Enzyme
Mol. Mass.:78452.28
Organism:Homo sapiens (Human)
Description:P14780
Residue:707
BDBM50143732
NameBDBM50143732
Synonyms:(2R,3R,4R,5R)-1-(4-Benzyloxy-benzenesulfonyl)-3,4,5-trihydroxy-piperidine-2-carboxylic acid hydroxyamide | CHEMBL58577
TypeSmall organic molecule
Emp. Form.C19H22N2O8S
Mol. Mass.438.452
SMILESONC(=O)[C@H]1[C@@H](O)[C@H](O)[C@H](O)CN1S(=O)(=O)c1ccc(OCc2ccccc2)cc1